disjunct-a
type: LexicalEntry
canonical form: disjunct
sense: 02491135-s
part of speech: adjective

02491135-s
type: LexicalConcept
in scheme: en-word.net
definition: having deep constrictions separating head, thorax, and abdomen, as in insects
ili: i13752
lexfile: adj.all
part of speech: adjective satellite
domain topic: 06092831-n
similar: https://en-word.net/synset/02488224-a