execute-v
type: LexicalEntry
canonical form: execute
sense: 02488856-v
part of speech: verb

put to death-v
type: LexicalEntry
canonical form: put to death
sense: 02488856-v
part of speech: verb

02488856-v
type: LexicalConcept
in scheme: en-word.net
definition: kill as a means of socially sanctioned punishment
example: In some states, criminals are executed
ili: i34134
lexfile: verb.social
part of speech: verb
hypernym: 01326622-v
hypernym: 02505278-v
similar: 02489797-v