segregate-v
type: LexicalEntry
canonical form: segregate
sense: 02487728-v
part of speech: verb

02487728-v
type: LexicalConcept
in scheme: en-word.net
definition: separate by race or religion; practice a policy of racial segregation
example: This neighborhood is segregated
example: We don't segregate in this county
ili: i34129
lexfile: verb.social
part of speech: verb
hypernym: 02517971-v