appoint-v
type: LexicalEntry
canonical form: appoint
sense: 02481345-v
part of speech: verb

charge-v
type: LexicalEntry
canonical form: charge
sense: 02481345-v
part of speech: verb

02481345-v
type: LexicalConcept
in scheme: en-word.net
definition: assign a duty, responsibility or obligation to
example: He was appointed deputy manager
example: She was charged with supervising the creation of a concordance
ili: i34100
lexfile: verb.social
part of speech: verb
hypernym: 02372362-v