unite-v
type: LexicalEntry
canonical form: unite
sense: 02475258-v
part of speech: verb

unify-v
type: LexicalEntry
canonical form: unify
sense: 02475258-v
part of speech: verb

02475258-v
type: LexicalConcept
in scheme: en-word.net
definition: act in concert or unite in a common purpose or belief
ili: i34069
lexfile: verb.social
part of speech: verb
hypernym: 02439823-v