sign-v
type: LexicalEntry
canonical form: sign
sense: 02470289-v
part of speech: verb

ratify-v
type: LexicalEntry
canonical form: ratify
sense: 02470289-v
part of speech: verb

02470289-v
type: LexicalConcept
in scheme: en-word.net
definition: approve and express assent, responsibility, or obligation
example: All parties ratified the peace treaty
example: Have you signed your contract yet?
ili: i34045
lexfile: verb.social
part of speech: verb
entails: 00999839-v
hypernym: 02484290-v