poll-v
type: LexicalEntry
canonical form: poll
sense: 02468721-v
part of speech: verb

02468721-v
type: LexicalConcept
in scheme: en-word.net
definition: vote in an election at a polling station
ili: i34035
lexfile: verb.social
part of speech: verb
hypernym: 02466737-v