vote-v
type: LexicalEntry
canonical form: vote
sense: 02467624-v
part of speech: verb

02467624-v
type: LexicalConcept
in scheme: en-word.net
definition: bring into existence or make available by vote
example: They voted aid for the underdeveloped countries in Asia
ili: i34029
lexfile: verb.social
part of speech: verb
hypernym: 02467809-v