patrol-v
type: LexicalEntry
canonical form: patrol
sense: 02460361-v
part of speech: verb

police-v
type: LexicalEntry
canonical form: police
sense: 02460361-v
part of speech: verb

02460361-v
type: LexicalConcept
in scheme: en-word.net
definition: maintain the security of by carrying out a patrol
ili: i33997
lexfile: verb.social
part of speech: verb
hypernym: 02461453-v