poisonous-a
type: LexicalEntry
canonical form: poisonous
sense: 02459585-s
part of speech: adjective

toxicant-a
type: LexicalEntry
canonical form: toxicant
sense: 02459585-s
part of speech: adjective

02459585-s
type: LexicalConcept
in scheme: en-word.net
definition: having the qualities or effects of a poison
ili: i13583
lexfile: adj.all
part of speech: adjective satellite
similar: https://en-word.net/synset/02458503-a