muzzle-n
type: LexicalEntry
canonical form: muzzle
sense: 02455095-n
part of speech: noun

02455095-n
type: LexicalConcept
in scheme: en-word.net
definition: forward projecting part of the head of certain animals; includes the jaws and nose
ili: i48545
lexfile: noun.animal
part of speech: noun
hypernym: 05608953-n
mero part: 02455268-n