warm up-v
type: LexicalEntry
canonical form: warm up
sense: 02449262-v
part of speech: verb

02449262-v
type: LexicalConcept
in scheme: en-word.net
definition: run until the normal working temperature is reached
example: We warmed up the car for a few minutes
ili: i33946
lexfile: verb.social
part of speech: verb
hypernym: 02448714-v