tonic-a
type: LexicalEntry
canonical form: tonic
sense: 02447247-s
part of speech: adjective

02447247-s
type: LexicalConcept
in scheme: en-word.net
definition: relating to or being the keynote of a major or minor scale
example: tonic harmony
ili: i13499
lexfile: adj.all
part of speech: adjective satellite
similar: https://en-word.net/synset/02446352-a