tolerant-a
type: LexicalEntry
canonical form: tolerant
sense: 02444201-s
part of speech: adjective

resistant-a
type: LexicalEntry
canonical form: resistant
sense: 02444201-s
part of speech: adjective

02444201-s
type: LexicalConcept
in scheme: en-word.net
definition: able to tolerate environmental conditions or physiological stress
example: the plant is tolerant of saltwater
example: these fish are quite tolerant as long as extremes of pH are avoided
example: the new hybrid is more resistant to drought
ili: i13484
lexfile: adj.all
part of speech: adjective satellite
similar: https://en-word.net/synset/02443844-a