unionize-v
type: LexicalEntry
canonical form: unionize
sense: 02440714-v
part of speech: verb

unionise-v
type: LexicalEntry
canonical form: unionise
sense: 02440714-v
part of speech: verb

02440714-v
type: LexicalConcept
in scheme: en-word.net
definition: recruit for a union or organize into a union
example: We don't allow people to come into our plant and try to unionize the workers
ili: i33906
lexfile: verb.social
part of speech: verb
causes: 02439085-v
hypernym: 02476750-v