organize-v
type: LexicalEntry
canonical form: organize
sense: 02437377-v
part of speech: verb

organise-v
type: LexicalEntry
canonical form: organise
sense: 02437377-v
part of speech: verb

02437377-v
type: LexicalConcept
in scheme: en-word.net
definition: cause to be structured or ordered or operating according to some principle or idea
ili: i33890
lexfile: verb.social
part of speech: verb
hypernym: 02441196-v