ally-v
type: LexicalEntry
canonical form: ally
sense: 02435038-v
part of speech: verb

02435038-v
type: LexicalConcept
in scheme: en-word.net
definition: become an ally or associate, as by a treaty or marriage
example: He allied himself with the Communists
ili: i33881
lexfile: verb.social
part of speech: verb
hypernym: 02595401-v