deer-n
type: LexicalEntry
canonical form: deer
sense: 02432691-n
part of speech: noun

cervid-n
type: LexicalEntry
canonical form: cervid
sense: 02432691-n
part of speech: noun

02432691-n
type: LexicalConcept
in scheme: en-word.net
definition: distinguished from Bovidae by the male's having solid deciduous antlers
ili: i48406
lexfile: noun.animal
part of speech: noun
hypernym: 02401652-n
mero part: 01328299-n
mero part: 02161391-n
mero part: 02161498-n
mero part: 02465233-n