ordain-v
type: LexicalEntry
canonical form: ordain
sense: 02432573-v
part of speech: verb

02432573-v
type: LexicalConcept
in scheme: en-word.net
definition: invest with ministerial or priestly authority
example: The minister was ordained only last month
ili: i33870
lexfile: verb.social
part of speech: verb
hypernym: 02391530-v