open-v
type: LexicalEntry
canonical form: open
sense: 02431018-v
part of speech: verb

open up-v
type: LexicalEntry
canonical form: open up
sense: 02431018-v
part of speech: verb

02431018-v
type: LexicalConcept
in scheme: en-word.net
definition: start to operate or function or cause to start operating or functioning
example: open a business
ili: i33864
lexfile: verb.social
part of speech: verb
hypernym: 00346415-v