daydream-v
type: LexicalEntry
canonical form: daydream
sense: 02423305-v
part of speech: verb

moon-v
type: LexicalEntry
canonical form: moon
sense: 02423305-v
part of speech: verb

02423305-v
type: LexicalConcept
in scheme: en-word.net
definition: have dreamlike musings or fantasies while awake
example: She looked out the window, daydreaming
ili: i33827
lexfile: verb.social
part of speech: verb
hypernym: 02422604-v