work at-v
type: LexicalEntry
canonical form: work at
sense: 02420169-v
part of speech: verb

work on-v
type: LexicalEntry
canonical form: work on
sense: 02420169-v
part of speech: verb

02420169-v
type: LexicalConcept
in scheme: en-word.net
definition: to exert effort in order to do, make, or perform something
example: the child worked at the multiplication table until she had it down cold
ili: i33812
lexfile: verb.social
part of speech: verb
hypernym: 02418610-v