assist-v
type: LexicalEntry
canonical form: assist
sense: 02419840-v
part of speech: verb

02419840-v
type: LexicalConcept
in scheme: en-word.net
definition: act as an assistant in a subordinate or supportive function
ili: i33810
lexfile: verb.social
part of speech: verb
hypernym: 02418610-v