moderate-a
type: LexicalEntry
canonical form: moderate
sense: 02410802-s
part of speech: adjective

restrained-a
type: LexicalEntry
canonical form: restrained
sense: 02410802-s
part of speech: adjective

02410802-s
type: LexicalConcept
in scheme: en-word.net
definition: marked by avoidance of extravagance or extremes
example: moderate in his demands
example: restrained in his response
ili: i13296
lexfile: adj.all
part of speech: adjective satellite
similar: https://en-word.net/synset/02410314-a