nominate-v
type: LexicalEntry
canonical form: nominate
sense: 02406665-v
part of speech: verb

propose-v
type: LexicalEntry
canonical form: propose
sense: 02406665-v
part of speech: verb

02406665-v
type: LexicalConcept
in scheme: en-word.net
definition: put forward; nominate for appointment to an office or for an honor or position
example: The President nominated her as head of the Civil Rights Commission
ili: i33754
lexfile: verb.social
part of speech: verb
hypernym: 00676526-v