hot-a
type: LexicalEntry
canonical form: hot
sense: 02406317-s
part of speech: adjective

spicy-a
type: LexicalEntry
canonical form: spicy
sense: 02406317-s
part of speech: adjective

02406317-s
type: LexicalConcept
in scheme: en-word.net
definition: producing a burning sensation on the taste nerves
example: hot salsa
example: jalapeno peppers are very hot
example: a spicy sauce
example: I like my chili extra spicy
ili: i13270
lexfile: adj.all
part of speech: adjective satellite
similar: https://en-word.net/synset/02403682-a