bitter-a
type: LexicalEntry
canonical form: bitter
sense: 02404683-s
part of speech: adjective

02404683-s
type: LexicalConcept
in scheme: en-word.net
definition: causing a sharp and acrid taste experience
example: quinine is bitter
ili: i13259
lexfile: adj.all
part of speech: adjective satellite
similar: https://en-word.net/synset/02403682-a