cover-v
type: LexicalEntry
canonical form: cover
sense: 02400336-v
part of speech: verb

02400336-v
type: LexicalConcept
in scheme: en-word.net
definition: help out by taking someone's place and temporarily assuming their responsibilities
example: She is covering for our secretary who is ill this week
ili: i33723
lexfile: verb.social
part of speech: verb
hypernym: 02399804-v