cover-v
type: LexicalEntry
canonical form: cover
sense: 02400142-v
part of speech: verb

02400142-v
type: LexicalConcept
in scheme: en-word.net
definition: to take an action to protect against future problems
example: Count the cash in the drawer twice just to cover yourself
ili: i33722
lexfile: verb.social
part of speech: verb
hypernym: 01130619-v
similar: 00892737-v