transfer-v
type: LexicalEntry
canonical form: transfer
sense: 02398228-v
part of speech: verb

reassign-v
type: LexicalEntry
canonical form: reassign
sense: 02398228-v
part of speech: verb

02398228-v
type: LexicalConcept
in scheme: en-word.net
definition: transfer somebody to a different position or location of work
ili: i33713
lexfile: verb.social
part of speech: verb
hypernym: 02396945-v