stalking-horse-n
type: LexicalEntry
canonical form: stalking-horse
sense: 02388550-n
part of speech: noun

02388550-n
type: LexicalConcept
in scheme: en-word.net
definition: a horse behind which a hunter hides while stalking game
ili: i48135
lexfile: noun.animal
part of speech: noun
hypernym: 02377103-n