drop out-v
type: LexicalEntry
canonical form: drop out
sense: 02388080-v
part of speech: verb

02388080-v
type: LexicalConcept
in scheme: en-word.net
definition: leave school or an educational program prematurely
example: Many students drop out because they are not prepared for our challenging program
ili: i33670
lexfile: verb.social
part of speech: verb
hypernym: 02388582-v
similar: 02388316-v