abdicate-v
type: LexicalEntry
canonical form: abdicate
sense: 02384340-v
part of speech: verb

renounce-v
type: LexicalEntry
canonical form: renounce
sense: 02384340-v
part of speech: verb

02384340-v
type: LexicalConcept
in scheme: en-word.net
definition: give up, such as power, as of monarchs and emperors, or duties and obligations
example: The King abdicated when he married a divorcee
ili: i33653
lexfile: verb.social
part of speech: verb
hypernym: 02372031-v