assert-v
type: LexicalEntry
canonical form: assert
sense: 02378876-v
part of speech: verb

put forward-v
type: LexicalEntry
canonical form: put forward
sense: 02378876-v
part of speech: verb

02378876-v
type: LexicalConcept
in scheme: en-word.net
definition: insist on having one's opinions and rights recognized
example: Women should assert themselves more!
ili: i33625
lexfile: verb.social
part of speech: verb
hypernym: 00010428-v