venture-v
type: LexicalEntry
canonical form: venture
sense: 02378427-v
part of speech: verb

embark-v
type: LexicalEntry
canonical form: embark
sense: 02378427-v
part of speech: verb

02378427-v
type: LexicalConcept
in scheme: en-word.net
definition: proceed somewhere despite the risk of possible dangers
example: We ventured into the world of high-tech and bought a supercomputer
ili: i33623
lexfile: verb.social
part of speech: verb
hypernym: 02377696-v