reciprocate-v
type: LexicalEntry
canonical form: reciprocate
sense: 02377417-v
part of speech: verb

02377417-v
type: LexicalConcept
in scheme: en-word.net
definition: act, feel, or give mutually or in return
example: We always invite the neighbors and they never reciprocate!
ili: i33620
lexfile: verb.social
part of speech: verb
hypernym: 02372362-v