horse-n
type: LexicalEntry
canonical form: horse
sense: 02377103-n
part of speech: noun

Equus caballus-n
type: LexicalEntry
canonical form: Equus caballus
sense: 02377103-n
part of speech: noun

02377103-n
type: LexicalConcept
in scheme: en-word.net
definition: solid-hoofed herbivorous quadruped domesticated since prehistoric times
ili: i48054
lexfile: noun.animal
part of speech: noun
hypernym: 02376801-n
mero member: 02379194-n
mero part: 01902535-n
mero part: 01904915-n
mero part: 02161769-n
mero part: 02465233-n
mero part: 02466544-n
mero part: 05546645-n
mero part: 07682151-n