act-v
type: LexicalEntry
canonical form: act
sense: 02372362-v
part of speech: verb

move-v
type: LexicalEntry
canonical form: move
sense: 02372362-v
part of speech: verb

02372362-v
type: LexicalConcept
in scheme: en-word.net
definition: perform an action, or work out or perform (an action)
example: think before you act
example: We must move quickly
example: The governor should act on the new energy bill
example: The nanny acted quickly by grabbing the toddler and covering him with a wet towel
ili: i33603
lexfile: verb.social
part of speech: verb