fee-tail-v
type: LexicalEntry
canonical form: fee-tail
sense: 02368233-v
part of speech: verb

entail-v
type: LexicalEntry
canonical form: entail
sense: 02368233-v
part of speech: verb

02368233-v
type: LexicalConcept
in scheme: en-word.net
definition: limit the inheritance of property to a specific class of heirs
ili: i33571
lexfile: verb.possession
part of speech: verb
hypernym: 02233837-v