top-v
type: LexicalEntry
canonical form: top
sense: 02365496-v
part of speech: verb

top out-v
type: LexicalEntry
canonical form: top out
sense: 02365496-v
part of speech: verb

02365496-v
type: LexicalConcept
in scheme: en-word.net
definition: provide with a top or finish the top (of a structure)
example: the towers were topped with conical roofs
ili: i33555
lexfile: verb.possession
part of speech: verb
hypernym: 02332196-v