get-v
type: LexicalEntry
canonical form: get
sense: 02364339-v
part of speech: verb

02364339-v
type: LexicalConcept
in scheme: en-word.net
definition: acquire as a result of some effort or action
example: You cannot get water out of a stone
example: Where did she get these news?
ili: i33548
lexfile: verb.possession
part of speech: verb
hypernym: 02215637-v
similar: 00641511-v
similar: 00591299-v