entrust-v
type: LexicalEntry
canonical form: entrust
sense: 02361226-v
part of speech: verb

leave-v
type: LexicalEntry
canonical form: leave
sense: 02361226-v
part of speech: verb

02361226-v
type: LexicalConcept
in scheme: en-word.net
definition: put into the care or protection of someone
example: He left the decision to his deputy
example: leave your child in the nurse's care
ili: i33530
lexfile: verb.possession
part of speech: verb
hypernym: 02235554-v