constitutionalize-v
type: LexicalEntry
canonical form: constitutionalize
sense: 02358197-v
part of speech: verb

02358197-v
type: LexicalConcept
in scheme: en-word.net
definition: provide with a constitution, as of a country
example: The United States were constitutionalized in the late 18th century
ili: i33511
lexfile: verb.possession
part of speech: verb
hypernym: 02332196-v