clear-v
type: LexicalEntry
canonical form: clear
sense: 02355436-v
part of speech: verb

02355436-v
type: LexicalConcept
in scheme: en-word.net
definition: clear from impurities, blemishes, pollution, etc.
example: clear the water before it can be drunk
ili: i33491
lexfile: verb.possession
part of speech: verb
hypernym: 02355171-v