obligate-v
type: LexicalEntry
canonical form: obligate
sense: 02353178-v
part of speech: verb

02353178-v
type: LexicalConcept
in scheme: en-word.net
definition: commit in order to fulfill an obligation
example: obligate money
ili: i33479
lexfile: verb.possession
part of speech: verb
hypernym: 02354208-v