supplement-v
type: LexicalEntry
canonical form: supplement
sense: 02347128-v
part of speech: verb

02347128-v
type: LexicalConcept
in scheme: en-word.net
definition: add as a supplement to what seems insufficient
example: supplement your diet
ili: i33451
lexfile: verb.possession
part of speech: verb
entails: 02332196-v
hypernym: 00182551-v
similar: 02758806-v