feeble-a
type: LexicalEntry
canonical form: feeble
sense: 02333032-s
part of speech: adjective

lame-a
type: LexicalEntry
canonical form: lame
sense: 02333032-s
part of speech: adjective

02333032-s
type: LexicalConcept
in scheme: en-word.net
definition: pathetically lacking in force or effectiveness
example: a feeble excuse
example: a lame argument
ili: i12879
lexfile: adj.all
part of speech: adjective satellite
similar: https://en-word.net/synset/02332106-a