rob-v
type: LexicalEntry
canonical form: rob
sense: 02326371-v
part of speech: verb

02326371-v
type: LexicalConcept
in scheme: en-word.net
definition: take something away by force or without the consent of the owner
example: The burglars robbed him of all his money
ili: i33343
lexfile: verb.possession
part of speech: verb
hypernym: 02326737-v