divest-v
type: LexicalEntry
canonical form: divest
sense: 02318886-v
part of speech: verb

disinvest-v
type: LexicalEntry
canonical form: disinvest
sense: 02318886-v
part of speech: verb

02318886-v
type: LexicalConcept
in scheme: en-word.net
definition: reduce or dispose of; cease to hold (an investment)
example: The company decided to divest
example: the board of trustees divested $20 million in real estate property
example: There was pressure on the university to disinvest in South Africa
ili: i33304
lexfile: verb.possession
part of speech: verb
hypernym: 02316367-v