give away-v
type: LexicalEntry
canonical form: give away
sense: 02298876-v
part of speech: verb

02298876-v
type: LexicalConcept
in scheme: en-word.net
definition: formally hand over to the bridegroom in marriage; of a bride by her father
ili: i33200
lexfile: verb.possession
part of speech: verb
hypernym: 02298282-v